Target
UDP-N-acetylenolpyruvoylglucosamine reductase
Ligand
BDBM50221018
Substrate
Meas. Tech.
ChEMBL_212271 (CHEMBL816295)
IC50
28000±n/a nM
Citation
 Li, ZFrancisco, GDHu, WLabthavikul, PPetersen, PJSeverin, ASingh, GYang, YRasmussen, BALin, YISkotnicki, JSMansour, TS 2-Phenyl-5,6-dihydro-2H-thieno[3,2-c]pyrazol-3-ol derivatives as new inhibitors of bacterial cell wall biosynthesis. Bioorg Med Chem Lett 13:2591-4 (2003)  
Target
Name:
UDP-N-acetylenolpyruvoylglucosamine reductase
Synonyms:
MURB_STAAU UDP-N-acetylenolpyruvoylglucosamine reductase | murB
Type:
Protein
Mol. Mass.:
33791.48
Organism:
Staphylococcus aureus (Firmicutes)
Description:
S. aureus MurB
Residue:
307
  
Inhibitor
Name:
BDBM50221018
Synonyms:
CHEMBL85772
Type:
Small organic molecule
Emp. Form.:
C11H9ClN2OS
Mol. Mass.:
252.72
SMILES:
Oc1c2SCCc2nn1-c1ccc(Cl)cc1
: