Target
UDP-N-acetylenolpyruvoylglucosamine reductase
Ligand
BDBM50221026
Substrate
Meas. Tech.
ChEMBL_212271 (CHEMBL816295)
IC50
>70500±n/a nM
Citation
 Li, ZFrancisco, GDHu, WLabthavikul, PPetersen, PJSeverin, ASingh, GYang, YRasmussen, BALin, YISkotnicki, JSMansour, TS 2-Phenyl-5,6-dihydro-2H-thieno[3,2-c]pyrazol-3-ol derivatives as new inhibitors of bacterial cell wall biosynthesis. Bioorg Med Chem Lett 13:2591-4 (2003)  
Target
Name:
UDP-N-acetylenolpyruvoylglucosamine reductase
Synonyms:
MURB_STAAU UDP-N-acetylenolpyruvoylglucosamine reductase | murB
Type:
Protein
Mol. Mass.:
33791.48
Organism:
Staphylococcus aureus (Firmicutes)
Description:
S. aureus MurB
Residue:
307
  
Inhibitor
Name:
BDBM50221026
Synonyms:
CHEMBL89482
Type:
Small organic molecule
Emp. Form.:
C13H8F6N2OS
Mol. Mass.:
354.271
SMILES:
Oc1c2SCCc2nn1-c1cc(cc(c1)C(F)(F)F)C(F)(F)F
: