Target
Phospho-N-acetylmuramoyl-pentapeptide-transferase
Ligand
BDBM50221483
Substrate
Meas. Tech.
ChEMBL_208267 (CHEMBL813227)
IC50
253±n/a nM
Citation
 Hotoda, HDaigo, MFurukawa, MMurayama, KHasegawa, CAKaneko, MMuramatsu, YIshii, MMMiyakoshi, STakatsu, TInukai, MKakuta, MAbe, TFukuoka, TUtsui, YOhya, S Synthesis and antimycobacterial activity of capuramycin analogues. Part 2: acylated derivatives of capuramycin-related compounds. Bioorg Med Chem Lett 13:2833-6 (2003)  
Target
Name:
Phospho-N-acetylmuramoyl-pentapeptide-transferase
Synonyms:
MRAY_ECOLI mraY | murX
Type:
PROTEIN
Mol. Mass.:
39889.38
Organism:
Escherichia coli (strain K12)
Description:
ChEMBL_1454117
Residue:
360
  
Inhibitor
Name:
BDBM50221483
Synonyms:
CHEMBL95124
Type:
Small organic molecule
Emp. Form.:
C32H47N5O13
Mol. Mass.:
709.7413
SMILES:
[H][C@@]1(O[C@H]([C@H](OC(=O)CCCCCCCC)[C@@H]1OC)n1ccc(=O)[nH]c1=O)[C@@H](O[C@H]1OC(=C[C@H](O)[C@@H]1O)C(=O)N[C@H]1CCCCNC1=O)C(N)=O
: