Target
Histone deacetylase (HDAC1 and HDAC2)
Ligand
BDBM50221814
Substrate
Meas. Tech.
ChEMBL_87403 (CHEMBL693167)
IC50
4.3±n/a nM
Citation
 Wada, CKFrey, RRJi, ZCurtin, MLGarland, RBHolms, JHLi, JPease, LJGuo, JGlaser, KBMarcotte, PARichardson, PLMurphy, SSBouska, JJTapang, PMagoc, TJAlbert, DHDavidsen, SKMichaelides, MR Alpha-keto amides as inhibitors of histone deacetylase. Bioorg Med Chem Lett 13:3331-5 (2003)  
Target
Name:
Histone deacetylase (HDAC1 and HDAC2)
Synonyms:
HDACs | Histone deacetylase 1/2
Type:
Mol. Mass.:
Description:
ASSAY_ID of ChEMBL is 2197604
Components:
This complex has 2 components.
Component 1
Name:
Histone deacetylase 1
Synonyms:
Cereblon/Histone deacetylase 1 HDAC1 Histone deacetylase 1 (HDAC1) RPD3L1
Type:
Enzyme
Mol. Mass.:
55090.27
Organism:
Homo sapiens (Human)
Description:
Q13547
Residue:
482
  
Component 2
Name:
Histone deacetylase 2
Synonyms:
Cereblon/Histone deacetylase 2 HDAC2 Histone deacetylase 2 (HDAC2) | Human HDAC2
Type:
Chromatin regulator; hydrolase; repressor
Mol. Mass.:
55356.54
Organism:
Homo sapiens (Human)
Description:
Q92769
Residue:
488
  
Inhibitor
Name:
BDBM50221814
Synonyms:
CHEMBL113034
Type:
Small organic molecule
Emp. Form.:
C18H22N4O3S
Mol. Mass.:
374.457
SMILES:
CNC(=O)C(=O)CCCCCCC(=O)Nc1nc(cs1)-c1ccncc1
: