Target
Prostaglandin G/H synthase 2
Ligand
BDBM50422575
Substrate
Meas. Tech.
ChEMBL_157825 (CHEMBL769429)
IC50
929±n/a nM
Citation
 Hyup, YHKwan, JKKang, SHNoh, MSHa, JYKyu, JKMin, KMHoon, CHChung, S 2,3-Diarylbenzopyran derivatives as a novel class of selective cyclooxygenase-2 inhibitors. Bioorg Med Chem Lett 13:413-7 (2003)  
Target
Name:
Prostaglandin G/H synthase 2
Synonyms:
Cox-2 Cyclooxygenase-2 Glucocorticoid-regulated inflammatory cyclooxygenase Macrophage activation-associated marker protein P71/73 PGH synthase 2 PGHS-2 Pghs-b Prostaglandin H2 synthase 2 Ptgs2 Tis10
Type:
Protein
Mol. Mass.:
69020.39
Organism:
Mus musculus (Mouse)
Description:
Q05769
Residue:
604
  
Inhibitor
Name:
BDBM50422575
Synonyms:
CHEMBL133659
Type:
Small organic molecule
Emp. Form.:
C22H16O4S
Mol. Mass.:
376.425
SMILES:
CS(=O)(=O)c1ccc(cc1)-c1oc2ccccc2c(=O)c1-c1ccccc1
: