Target
Carbonic anhydrase 2
Ligand
BDBM50079053
Substrate
Meas. Tech.
ChEMBL_45247 (CHEMBL658950)
Ki
33.0±n/a nM
Citation
 Agrawal, VKKhadikar, PV Modelling of carbonic anhydrase inhibitory activity of sulfonamides using molecular negentropy. Bioorg Med Chem Lett 13:447-53 (2003)  
Target
Name:
Carbonic anhydrase 2
Synonyms:
CA-II CAC Carbonate dehydratase II Carbonic anhydrase 2 (CA-II) Carbonic anhydrase C Carbonic anhydrase II (CA-II) Carbonic anhydrase II (hCA II) | Carbonic anhydrase isoenzyme II (hCA II)
Type:
Enzyme
Mol. Mass.:
29250.71
Organism:
Homo sapiens (Human)
Description:
P00918
Residue:
260
  
Inhibitor
Name:
BDBM50079053
Synonyms:
4-(5,7-Dioxo-5,7-dihydro-pyrrolo[3,4-b]pyridin-6-yl)-3-iodo-benzenesulfonamide CHEMBL327933
Type:
Small organic molecule
Emp. Form.:
C13H8IN3O4S
Mol. Mass.:
429.19
SMILES:
NS(=O)(=O)c1ccc(N2C(=O)c3cccnc3C2=O)c(I)c1
: