Target
Carbonic anhydrase 4
Ligand
BDBM50079029
Substrate
Meas. Tech.
ChEMBL_45434 (CHEMBL657034)
Ki
299±n/a nM
Citation
 Agrawal, VKKhadikar, PV Modelling of carbonic anhydrase inhibitory activity of sulfonamides using molecular negentropy. Bioorg Med Chem Lett 13:447-53 (2003)  
Target
Name:
Carbonic anhydrase 4
Synonyms:
CA-IV CAH4_BOVIN Carbonic Anhydrase IV Carbonic anhydrase 4
Type:
Enzyme
Mol. Mass.:
35152.74
Organism:
Bos taurus (bovine)
Description:
Bovine isozyme, isolated from lung microsomes
Residue:
312
  
Inhibitor
Name:
BDBM50079029
Synonyms:
6-(2-Sulfamoyl-phenylcarbamoyl)-pyridine-2-carboxylic acid | CHEMBL327669
Type:
Small organic molecule
Emp. Form.:
C13H11N3O5S
Mol. Mass.:
321.309
SMILES:
NS(=O)(=O)c1ccccc1NC(=O)c1cccc(n1)C(O)=O
: