Target
Carbonic anhydrase 4
Ligand
BDBM50079065
Substrate
Meas. Tech.
ChEMBL_45434 (CHEMBL657034)
Ki
70.0±n/a nM
Citation
 Agrawal, VKKhadikar, PV Modelling of carbonic anhydrase inhibitory activity of sulfonamides using molecular negentropy. Bioorg Med Chem Lett 13:447-53 (2003)  
Target
Name:
Carbonic anhydrase 4
Synonyms:
CA-IV CAH4_BOVIN Carbonic Anhydrase IV Carbonic anhydrase 4
Type:
Enzyme
Mol. Mass.:
35152.74
Organism:
Bos taurus (bovine)
Description:
Bovine isozyme, isolated from lung microsomes
Residue:
312
  
Inhibitor
Name:
BDBM50079065
Synonyms:
6-(4-Sulfamoyl-benzylcarbamoyl)-pyridine-2-carboxylic acid | CHEMBL315661
Type:
Small organic molecule
Emp. Form.:
C14H13N3O5S
Mol. Mass.:
335.335
SMILES:
NS(=O)(=O)c1ccc(CNC(=O)c2cccc(n2)C(O)=O)cc1
: