Target
Carbonic anhydrase 1
Ligand
BDBM50079030
Substrate
Meas. Tech.
ChEMBL_44860 (CHEMBL858760)
Ki
540±n/a nM
Citation
 Agrawal, VKKhadikar, PV Modelling of carbonic anhydrase inhibitory activity of sulfonamides using molecular negentropy. Bioorg Med Chem Lett 13:447-53 (2003)  
Target
Name:
Carbonic anhydrase 1
Synonyms:
CA-I CAB Carbonate dehydratase I Carbonic anhydrase 1 (CA I) Carbonic anhydrase 1 (Recombinant CA I) Carbonic anhydrase B Carbonic anhydrase I (CA I) Carbonic anhydrase I (CAI) Carbonic anhydrase isoenzyme I (hCA I) | hCA
Type:
Enzyme
Mol. Mass.:
28873.37
Organism:
Homo sapiens (Human)
Description:
P00915
Residue:
261
  
Inhibitor
Name:
BDBM50079030
Synonyms:
4-(5,7-Dioxo-5,7-dihydro-pyrrolo[3,4-b]pyridin-6-yl)-3-fluoro-benzenesulfonamide CHEMBL88120
Type:
Small organic molecule
Emp. Form.:
C13H8FN3O4S
Mol. Mass.:
321.284
SMILES:
NS(=O)(=O)c1ccc(N2C(=O)c3cccnc3C2=O)c(F)c1
: