Target
Carbonic anhydrase 2
Ligand
BDBM10862
Substrate
Meas. Tech.
ChEMBL_45247 (CHEMBL658950)
Ki
60.0±n/a nM
Citation
 Agrawal, VKKhadikar, PV Modelling of carbonic anhydrase inhibitory activity of sulfonamides using molecular negentropy. Bioorg Med Chem Lett 13:447-53 (2003)  
Target
Name:
Carbonic anhydrase 2
Synonyms:
CA-II CAC Carbonate dehydratase II Carbonic anhydrase 2 (CA-II) Carbonic anhydrase C Carbonic anhydrase II (CA-II) Carbonic anhydrase II (hCA II) | Carbonic anhydrase isoenzyme II (hCA II)
Type:
Enzyme
Mol. Mass.:
29250.71
Organism:
Homo sapiens (Human)
Description:
P00918
Residue:
260
  
Inhibitor
Name:
BDBM10862
Synonyms:
4-Amino-3-fluorobenzenesulfonamide CHEMBL6853 halogenosulfanilamide deriv. 5b
Type:
Small organic molecule
Emp. Form.:
C6H7FN2O2S
Mol. Mass.:
190.195
SMILES:
Nc1ccc(cc1F)S(N)(=O)=O
: