Target
Gonadotropin-releasing hormone receptor
Ligand
BDBM50409919
Substrate
Meas. Tech.
ChEMBL_100015 (CHEMBL709253)
Ki
0.331131±n/a nM
Citation
 Randolph, JTSauer, DRHaviv, FNilius, AMGreer, J Elimination of antibacterial activities of non-peptide luteinizing hormone-releasing hormone (LHRH) antagonists derived from erythromycin A. Bioorg Med Chem Lett 14:1599-602 (2004)  
Target
Name:
Gonadotropin-releasing hormone receptor
Synonyms:
GNRHR GRHR GnRH-R Gonadotropin-releasing hormone receptor | Gonadotropin-releasing hormone receptor (GnRH)
Type:
Enzyme
Mol. Mass.:
37749.45
Organism:
Homo sapiens (Human)
Description:
P30968
Residue:
328
  
Inhibitor
Name:
BDBM50409919
Synonyms:
CHEMBL12282
Type:
Small organic molecule
Emp. Form.:
C47H69ClFN3O13
Mol. Mass.:
938.514
SMILES:
CC[C@H]1OC(=O)[C@H](C)[C@@H](OC(=O)N2[C@@H](C)COC2=O)[C@H](C)[C@@H](OC2O[C@H](C)C[C@@H]([C@H]2O)N(C)CC2CC2)[C@](C)(C[C@@H](C)C(=O)[C@H](C)[C@H]2N(CCc3ccc(F)c(Cl)c3)C(=O)O[C@]12C)OC
: