Target
Prostaglandin G/H synthase 1
Ligand
BDBM50224242
Substrate
Meas. Tech.
ChEMBL_159259 (CHEMBL764086)
IC50
27500±n/a nM
Citation
 Moh, JHChoi, YHLim, KMLee, KWShin, SSChoi, JKKoh, HJChung, S A prodrug approach to COX-2 inhibitors with methylsulfone. Bioorg Med Chem Lett 14:1757-60 (2004)  
Target
Name:
Prostaglandin G/H synthase 1
Synonyms:
Cox-1 Cyclooxygenase-1 PGH1_MOUSE PHS 1 Prostaglandin H2 synthase 1 Ptgs1
Type:
PROTEIN
Mol. Mass.:
69044.61
Organism:
Mus musculus
Description:
ChEMBL_10575
Residue:
602
  
Inhibitor
Name:
BDBM50224242
Synonyms:
CHEMBL295497
Type:
Small organic molecule
Emp. Form.:
C19H16F2O3S
Mol. Mass.:
362.39
SMILES:
C[S+]([O-])c1ccc(cc1)C1=C(C(=O)C(C)(C)O1)c1cc(F)cc(F)c1
: