Target
Presenilin-1
Ligand
BDBM50125395
Substrate
Meas. Tech.
ChEMBL_68893 (CHEMBL678615)
IC50
13±n/a nM
Citation
 Prasad, CVWallace, OBNoonan, JWSloan, CPLau, WVig, SParker, MFSmith, DWHansel, SBPolson, CTBarten, DMFelsenstein, KMRoberts, SB Hydroxytriamides as potent gamma-secretase inhibitors. Bioorg Med Chem Lett 14:1917-21 (2004)  
Target
Name:
Presenilin-1
Synonyms:
3.4.23.- Gamma-Secretase Subunit Presenilin-1 PS1 PSEN1 PSNL1 Presenilin-1 CTF12 Protein S182
Type:
Mol. Mass.:
52657.13
Organism:
Homo sapiens (Human)
Description:
P49768
Residue:
467
  
Inhibitor
Name:
BDBM50125395
Synonyms:
CHEMBL57259
Type:
Small organic molecule
Emp. Form.:
C28H45N3O3
Mol. Mass.:
471.6752
SMILES:
CC(C)C[C@H](NC(=O)Cc1ccccc1)C(=O)N[C@@H](CC1CCCCC1)C(=O)N(C)CC(C)C
: