Target
Presenilin-1
Ligand
BDBM50223762
Substrate
Meas. Tech.
ChEMBL_68893 (CHEMBL678615)
IC50
6.0±n/a nM
Citation
 Prasad, CVWallace, OBNoonan, JWSloan, CPLau, WVig, SParker, MFSmith, DWHansel, SBPolson, CTBarten, DMFelsenstein, KMRoberts, SB Hydroxytriamides as potent gamma-secretase inhibitors. Bioorg Med Chem Lett 14:1917-21 (2004)  
Target
Name:
Presenilin-1
Synonyms:
3.4.23.- Gamma-Secretase Subunit Presenilin-1 PS1 PSEN1 PSNL1 Presenilin-1 CTF12 Protein S182
Type:
Mol. Mass.:
52657.13
Organism:
Homo sapiens (Human)
Description:
P49768
Residue:
467
  
Inhibitor
Name:
BDBM50223762
Synonyms:
CHEMBL417588
Type:
Small organic molecule
Emp. Form.:
C28H43F2N3O3
Mol. Mass.:
507.6561
SMILES:
CCCCN(C)C(=O)[C@H](CC1CCCCC1)NC(=O)[C@H](CC(C)C)NC(=O)Cc1cc(F)cc(F)c1
: