Target
Tubulin beta chain
Ligand
BDBM50146019
Substrate
Meas. Tech.
ChEMBL_211665 (CHEMBL821417)
Ki
10500±n/a nM
Citation
 Zavala, FGuenard, DRobin, JPBrown, E Structure--antitubulin activity relationship in steganacin congeners and analogues. Inhibition of tubulin polymerization in vitro by (+/-)-isodeoxypodophyllotoxin. J Med Chem 23:546-9 (1980)  
Target
Name:
Tubulin beta chain
Synonyms:
Beta-tubulin Tubulin beta chain
Type:
PROTEIN
Mol. Mass.:
49840.26
Organism:
Sus scrofa
Description:
ChEMBL_105107
Residue:
445
  
Inhibitor
Name:
BDBM50146019
Synonyms:
steganacin
Type:
Small organic molecule
Emp. Form.:
C24H24O9
Mol. Mass.:
456.442
SMILES:
[H][C@]12Cc3cc(OC)c(OC)c(OC)c3-c3cc4OCOc4cc3[C@@]([H])(OC(C)=O)C1COC2=O
: