Target
Beta-1/Beta-2/Beta-3 adrenergic receptor
Ligand
BDBM50222776
Substrate
Meas. Tech.
ChEMBL_38754 (CHEMBL651861)
Kd
5.0±n/a nM
Citation
 Lemke, TLCramer, MBAdamski, SWPedone, CABrooker, G beta-Adrenergic blocking agents. alpha- and gamma-methyl(aryloxy)propanolamines. J Med Chem 24:1211-4 (1981)  
Target
Name:
Beta-1/Beta-2/Beta-3 adrenergic receptor
Synonyms:
Adrenergic receptor beta
Type:
Mol. Mass.:
Description:
ASSAY_ID of ChEMBL is 1340543
Components:
This complex has 3 components.
Component 1
Name:
Beta-1 adrenergic receptor
Synonyms:
ADRB1R, B1AR Adrb1 Adrenergic receptor beta Beta-1 adrenoreceptor adrenergic Beta1,2
Type:
Protein
Mol. Mass.:
50486.84
Organism:
Rattus norvegicus (Rat)
Description:
P18090
Residue:
466
  
Component 2
Name:
Beta-2 adrenergic receptor
Synonyms:
ADRB2_RAT Adrb2r | Adrenergic receptor beta
Type:
PROTEIN
Mol. Mass.:
46896.26
Organism:
Rattus norvegicus
Description:
ChEMBL_38603
Residue:
418
  
Component 3
Name:
Beta-3 adrenergic receptor
Synonyms:
ADRB3_RAT Adrb3r Beta-3 adrenergic receptor
Type:
PROTEIN
Mol. Mass.:
43161.83
Organism:
Rattus norvegicus
Description:
ChEMBL_1509452
Residue:
400
  
Inhibitor
Name:
BDBM50222776
Synonyms:
CHEMBL19770
Type:
Small organic molecule
Emp. Form.:
C18H25NO2
Mol. Mass.:
287.3966
SMILES:
CC(Oc1ccc2ccccc2c1)C(O)CNC(C)(C)C
: