Target
Dihydrofolate reductase
Ligand
BDBM50405085
Substrate
Meas. Tech.
ChEMBL_54925 (CHEMBL857514)
Ki
4.8±n/a nM
Citation
 Coats, EAGenther, CSDietrich, SWGuo, ZRHansch, C Comparison of the inhibition of methotrexate-sensitive and -resistant Lactobacillus casei cell cultures with purified Lactobacillus casei dihydrofolate reductase by 4,6-diamino-1,2-dihydro-2,2-dimethyl-1-(3-substituted-phenyl)-s-triazines. Use of quantitative structure-activity relationships in maki J Med Chem 24:1422-9 (1981)  
Target
Name:
Dihydrofolate reductase
Synonyms:
DYR_LACCA folA
Type:
PROTEIN
Mol. Mass.:
18437.08
Organism:
Lactobacillus casei
Description:
ChEMBL_1357878
Residue:
163
  
Inhibitor
Name:
BDBM50405085
Synonyms:
CHEMBL6771
Type:
Small organic molecule
Emp. Form.:
C21H27N5O2
Mol. Mass.:
381.4714
SMILES:
CC1(C)N=C(N)N=C(N)N1c1cccc(OCCCCOc2ccccc2)c1
: