Target
Dihydrofolate reductase
Ligand
BDBM50405984
Substrate
Meas. Tech.
ChEMBL_53943 (CHEMBL668662)
Ki
2630±n/a nM
Citation
 Li, RLDietrich, SWHansch, C Quantitative structure-selectivity relationships. Comparison of the inhibition of Escherichia coli and bovine liver dihydrofolate reductase by 5-(substituted-benzyl)-2,4-diaminopyrimidines. J Med Chem 24:538-44 (1981)  
Target
Name:
Dihydrofolate reductase
Synonyms:
DHFR Dihydrofolate reductase | Dihydrofolate reductase (DHFR)
Type:
Enzyme
Mol. Mass.:
21603.71
Organism:
Bos taurus (Cattle)
Description:
P00376
Residue:
187
  
Inhibitor
Name:
BDBM50405984
Synonyms:
CHEMBL434787
Type:
Small organic molecule
Emp. Form.:
C12H14N4O3S
Mol. Mass.:
294.33
SMILES:
CS(=O)(=O)Oc1cccc(Cc2cnc(N)nc2N)c1
: