Target
Dihydrofolate reductase
Ligand
BDBM50405995
Substrate
Meas. Tech.
ChEMBL_53617 (CHEMBL665572)
pH
7.2±n/a
Ki
53703±n/a nM
Comments
extracted
Citation
 Li, RHansch, CKaufman, BT A comparison of the inhibitory action of 5-(substituted-benzyl)-2,4-diaminopyrimidines on dihydrofolate reductase from chicken liver with that from bovine liver. J Med Chem 25:435-40 (1982)  
Target
Name:
Dihydrofolate reductase
Synonyms:
1.5.1.3 DYR_CHICK
Type:
Mol. Mass.:
21652.69
Organism:
Gallus gallus (Chicken)
Description:
Residue:
189
  
Inhibitor
Name:
BDBM50405995
Synonyms:
CHEMBL31055
Type:
Small organic molecule
Emp. Form.:
C13H15N5O2
Mol. Mass.:
273.2905
SMILES:
NC(=O)COc1cccc(Cc2cnc(N)nc2N)c1
: