Target
Dihydrofolate reductase
Ligand
BDBM50391226
Substrate
Meas. Tech.
ChEMBL_53618 (CHEMBL663687)
pH
7.2±n/a
Ki
19498±n/a nM
Comments
extracted
Citation
 Li, RHansch, CKaufman, BT A comparison of the inhibitory action of 5-(substituted-benzyl)-2,4-diaminopyrimidines on dihydrofolate reductase from chicken liver with that from bovine liver. J Med Chem 25:435-40 (1982)  
Target
Name:
Dihydrofolate reductase
Synonyms:
1.5.1.3 DYR_CHICK
Type:
Mol. Mass.:
21652.69
Organism:
Gallus gallus (Chicken)
Description:
Residue:
189
  
Inhibitor
Name:
BDBM50391226
Synonyms:
CHEMBL265493
Type:
Small organic molecule
Emp. Form.:
C11H12N4
Mol. Mass.:
200.2398
SMILES:
Nc1ncc(Cc2ccccc2)c(N)n1
: