Target
Dihydrofolate reductase
Ligand
BDBM18069
Substrate
Meas. Tech.
ChEMBL_53618 (CHEMBL663687)
pH
7.2±n/a
Ki
104713±n/a nM
Comments
extracted
Citation
 Li, RHansch, CKaufman, BT A comparison of the inhibitory action of 5-(substituted-benzyl)-2,4-diaminopyrimidines on dihydrofolate reductase from chicken liver with that from bovine liver. J Med Chem 25:435-40 (1982)  
Target
Name:
Dihydrofolate reductase
Synonyms:
1.5.1.3 DYR_CHICK
Type:
Mol. Mass.:
21652.69
Organism:
Gallus gallus (Chicken)
Description:
Residue:
189
  
Inhibitor
Name:
BDBM18069
Synonyms:
5-[(3,4,5-trimethoxyphenyl)methyl]pyrimidine-2,4-diamine TMP Trimethoprim (TMP) | US10870625, Compound TMP
Type:
Small organic molecule
Emp. Form.:
C14H18N4O3
Mol. Mass.:
290.3177
SMILES:
COc1cc(Cc2cnc(N)nc2N)cc(OC)c1OC
: