Target
Dihydrofolate reductase
Ligand
BDBM50405959
Substrate
Meas. Tech.
ChEMBL_53930 (CHEMBL669352)
pH
7.2±n/a
Ki
2818±n/a nM
Comments
extracted
Citation
 Li, RHansch, CKaufman, BT A comparison of the inhibitory action of 5-(substituted-benzyl)-2,4-diaminopyrimidines on dihydrofolate reductase from chicken liver with that from bovine liver. J Med Chem 25:435-40 (1982)  
Target
Name:
Dihydrofolate reductase
Synonyms:
DHFR Dihydrofolate reductase | Dihydrofolate reductase (DHFR)
Type:
Enzyme
Mol. Mass.:
21603.71
Organism:
Bos taurus (Cattle)
Description:
P00376
Residue:
187
  
Inhibitor
Name:
BDBM50405959
Synonyms:
CHEMBL31912
Type:
Small organic molecule
Emp. Form.:
C17H24N4O
Mol. Mass.:
300.3987
SMILES:
CCCCCCOc1ccc(Cc2cnc(N)nc2N)cc1
: