Target
Alcohol dehydrogenase E/S chain
Ligand
BDBM50224831
Substrate
Meas. Tech.
ChEMBL_30849 (CHEMBL643567)
Ki
790000±n/a nM
Citation
 Chadha, VKLeidal, KGPlapp, BV Inhibition by carboxamides and sulfoxides of liver alcohol dehydrogenase and ethanol metabolism. J Med Chem 26:916-22 (1983)  
Target
Name:
Alcohol dehydrogenase E/S chain
Synonyms:
Alcohol dehydrogenase
Type:
Mol. Mass.:
Description:
ASSAY_ID of ChEMBL is 30849
Components:
This complex has 2 components.
Component 1
Name:
Alcohol dehydrogenase E chain
Synonyms:
1.1.1.1 Alcohol dehydrogenase E chain
Type:
PROTEIN
Mol. Mass.:
39942.66
Organism:
Equus caballus
Description:
ChEMBL_105061
Residue:
375
  
Component 2
Name:
Alcohol dehydrogenase S chain
Synonyms:
1.1.1.1 Alcohol dehydrogenase S chain
Type:
PROTEIN
Mol. Mass.:
39633.49
Organism:
Equus caballus
Description:
ChEMBL_105061
Residue:
374
  
Inhibitor
Name:
BDBM50224831
Synonyms:
CHEBI:51457 | CYCLOPROPANECARBOXYLIC ACID AMIDE
Type:
Small organic molecule
Emp. Form.:
C4H7NO
Mol. Mass.:
85.1045
SMILES:
NC(=O)C1CC1
: