Target
Amine oxidase [flavin-containing] A/B
Ligand
BDBM15581
Substrate
Meas. Tech.
ChEMBL_122636 (CHEMBL873949)
IC50
0.700000±n/a nM
Citation
 Sahlberg, CRoss, SBFagervall, IAsk, ALClaesson, A Synthesis and monoamine oxidase inhibitory activities of alpha-allenic amines in vivo and in vitro. Different activities of two enantiomeric allenes. J Med Chem 26:1036-42 (1983)  
Target
Name:
Amine oxidase [flavin-containing] A/B
Synonyms:
Monoamine oxidase
Type:
Mol. Mass.:
Description:
ASSAY_ID of ChEMBL is 122635
Components:
This complex has 2 components.
Component 1
Name:
Amine oxidase [flavin-containing] B
Synonyms:
AOFB_RAT Amine oxidase [flavin-containing] B Monoamine Oxidase Type B (MAO-B) Monoamine oxidase B (MAO-B) Monoamine oxidase type B (MAOB) | Monoamine oxidase-B (MAO-B)
Type:
Enzyme
Mol. Mass.:
58469.65
Organism:
Rattus norvegicus (rat)
Description:
P19643
Residue:
520
  
Component 2
Name:
Amine oxidase [flavin-containing] A
Synonyms:
AOFA_RAT Amine oxidase [flavin-containing] A Monoamine Oxidase Type A (MAO-A) Monoamine oxidase A (MAO-A) Monoamine oxidase type A (MAOA)
Type:
Enzyme
Mol. Mass.:
59515.21
Organism:
Rattus norvegicus (rat)
Description:
Residue:
526
  
Inhibitor
Name:
BDBM15581
Synonyms:
CHEMBL8706 CLORGILINE N-[3-(2,4-dichlorophenoxy)propyl]-N-methyl-prop-2-yn-1-amine US9603833, Clorgyline | [3-(2,4-dichlorophenoxy)propyl](methyl)prop-2-yn-1-ylamine
Type:
Small organic molecule
Emp. Form.:
C13H15Cl2NO
Mol. Mass.:
272.17
SMILES:
CN(CCCOc1ccc(Cl)cc1Cl)CC#C
: