Target
Dihydrofolate reductase
Ligand
BDBM18792
Substrate
Meas. Tech.
ChEMBL_54084 (CHEMBL669981)
Ki
631±n/a nM
Citation
 Hathaway, BAGuo, ZRHansch, CDelcamp, TJSusten, SSFreisheim, JH Inhibition of human dihydrofolate reductase by 4,6-diamino-1,2-dihydro-2,2-dimethyl-1-(substituted-phenyl)-s-triazine s. A quantitative structure-activity relationship analysis. J Med Chem 27:144-9 (1984)  
Target
Name:
Dihydrofolate reductase
Synonyms:
DHFR Dihydrofolate reductase (DHFR) | Tetrahydrofolate dehydrogenase
Type:
Enzyme
Mol. Mass.:
21453.99
Organism:
Homo sapiens (Human)
Description:
Recombinant human DHFR.
Residue:
187
  
Inhibitor
Name:
BDBM18792
Synonyms:
1-(4-chlorophenyl)-6,6-dimethyl-1,6-dihydro-1,3,5-triazine-2,4-diamine Chlorazin | Cycloguanil
Type:
Small organic molecule
Emp. Form.:
C11H14ClN5
Mol. Mass.:
251.715
SMILES:
CC1(C)N=C(N)N=C(N)N1c1ccc(Cl)cc1
: