Target
Dihydrofolate reductase type 1
Ligand
BDBM50225441
Substrate
Meas. Tech.
ChEMBL_54572 (CHEMBL664886)
Ki
1202±n/a nM
Citation
 Coats, EAGenther, CSSelassie, CDStrong, CDHansch, C Quantitative structure-activity relationship of antifolate inhibition of bacteria cell cultures resistant and sensitive to methotrexate. J Med Chem 28:1910-6 (1985)  
Target
Name:
Dihydrofolate reductase type 1
Synonyms:
DYR1_ECOLX | dhfrI
Type:
PROTEIN
Mol. Mass.:
17574.87
Organism:
Escherichia coli
Description:
ChEMBL_54248
Residue:
157
  
Inhibitor
Name:
BDBM50225441
Synonyms:
CHEMBL59212
Type:
Small organic molecule
Emp. Form.:
C14H21N5O
Mol. Mass.:
275.3494
SMILES:
CCOCc1cccc(c1)N1C(N)=NC(N)=NC1(C)C
: