Target
Metalloproteinase inhibitor 3
Ligand
BDBM50017543
Substrate
Meas. Tech.
ChEMBL_201215 (CHEMBL804010)
IC50
140±n/a nM
Citation
 Nordmann, RPetcher, TJ Octahydrobenzo[g]quinolines: potent dopamine agonists which show the relationship between ergolines and apomorphine. J Med Chem 28:367-75 (1985)  
Target
Name:
Metalloproteinase inhibitor 3
Synonyms:
TIMP3_RAT Timp3 Tissue inhibitor of metalloproteinases-3
Type:
PROTEIN
Mol. Mass.:
24241.51
Organism:
Rattus norvegicus
Description:
ChEMBL_10750
Residue:
211
  
Inhibitor
Name:
BDBM50017543
Synonyms:
(6aR,9R,10aR)-9-Methylsulfanylmethyl-7-propyl-4,6,6a,7,8,9,10,10a-octahydro-indolo[4,3-fg]quinolin-7-ium 5-Bromo-7-methyl-4,6,6a,7,8,9-hexahydro-indolo[4,3-fg]quinoline-9-carboxylic acid (10b-hydroxy-5-isobutyl-2-isopropyl-3,6-dioxo-octahydro-oxazolo[3,2-a]pyrrolo[2,1-c]pyrazin-2-yl)-amide 9-Methylsulfanylmethyl-7-propyl-4,6,6a,7,8,9,10,10a-octahydro-indolo[4,3-fg]quinoline 9-Methylsulfanylmethyl-7-propyl-4,6,6a,7,8,9,10,10a-octahydro-indolo[4,3-fg]quinoline, mesylate (Pergolide) PERGOLIDE [2-(1H-Indol-4-yl)-ethyl]-methyl-amine | cid_47811
Type:
Small organic molecule
Emp. Form.:
C19H26N2S
Mol. Mass.:
314.488
SMILES:
CCCN1C[C@H](CSC)C[C@H]2[C@H]1Cc1c[nH]c3cccc2c13
: