Target
Chymotrypsin-like elastase family member 1/2A
Ligand
BDBM50226401
Substrate
Meas. Tech.
ChEMBL_158072 (CHEMBL764901)
Ki
35000±n/a nM
Citation
 Digenis, GAAgha, BJTsuji, KKato, MShinogi, M Peptidyl carbamates incorporating amino acid isosteres as novel elastase inhibitors. J Med Chem 29:1468-76 (1986)  
Target
Name:
Chymotrypsin-like elastase family member 1/2A
Synonyms:
Pancreatic elastase
Type:
Mol. Mass.:
Description:
ASSAY_ID of ChEMBL is 152345
Components:
This complex has 2 components.
Component 1
Name:
Chymotrypsin-like elastase family member 1
Synonyms:
CELA1 ELA1 Elastase 1 Pancreatic elastase
Type:
Enzyme
Mol. Mass.:
28827.71
Organism:
Sus scrofa (Pig)
Description:
P00772
Residue:
266
  
Component 2
Name:
Chymotrypsin-like elastase family member 2A
Synonyms:
CEL2A_PIG ELA2 Elastase 2A Elastase-2A | Pancreatic elastase
Type:
PROTEIN
Mol. Mass.:
28705.23
Organism:
Sus scrofa
Description:
ChEMBL_156951
Residue:
269
  
Inhibitor
Name:
BDBM50226401
Synonyms:
CHEMBL3143927
Type:
Small organic molecule
Emp. Form.:
C27H33F5N4O8
Mol. Mass.:
636.5649
SMILES:
COC(=O)CCC(=O)N[C@@H](C)C(=O)N[C@@H](C)C(=O)N1CCC[C@H]1C(=O)CN(C(C)C)C(=O)Oc1c(F)c(F)c(F)c(F)c1F
: