Target
Dihydrofolate reductase
Ligand
BDBM50405999
Substrate
Meas. Tech.
ChEBML_54731
Ki
257±n/a nM
Citation
 Li, RLPoe, M Quantitative structure-activity relationships for the inhibition of Escherichia coli dihydrofolate reductase by 5-(substituted benzyl)-2,4-diaminopyrimidines. J Med Chem 31:366-70 (1988)  
Target
Name:
Dihydrofolate reductase
Synonyms:
Dihydrofolate reductase (F31V) | dfrA17
Type:
Mol. Mass.:
17532.46
Organism:
Escherichia coli
Description:
Residue:
157
  
Inhibitor
Name:
BDBM50405999
Synonyms:
CHEMBL31462
Type:
Small organic molecule
Emp. Form.:
C13H16N4O
Mol. Mass.:
244.2923
SMILES:
COCc1cccc(Cc2cnc(N)nc2N)c1
: