Target
Lactoylglutathione lyase
Ligand
BDBM50227445
Substrate
Meas. Tech.
ChEMBL_71295 (CHEMBL684310)
Ki
8910±n/a nM
Citation
 Doweyko, AM The hypothetical active site lattice. An approach to modelling active sites from data on inhibitor molecules. J Med Chem 31:1396-406 (1988)  
Target
Name:
Lactoylglutathione lyase
Synonyms:
Aldoketomutase Glx I Glyoxalase I LGUL_HUMAN S-D-lactoylglutathione methylglyoxal lyase
Type:
Enzyme
Mol. Mass.:
20772.95
Organism:
Homo sapiens (Human)
Description:
Q04760
Residue:
184
  
Inhibitor
Name:
BDBM50227445
Synonyms:
CHEMBL31543
Type:
Small organic molecule
Emp. Form.:
C19H27N3O6S
Mol. Mass.:
425.499
SMILES:
N[C@@H](CCC(=O)NC(CSCCCc1ccccc1)C(=O)NCC(O)=O)C(O)=O
: