Target
Isoleucine--tRNA ligase
Ligand
BDBM50227811
Substrate
Meas. Tech.
ChEMBL_88803 (CHEMBL699460)
IC50
3310±n/a nM
Citation
 Klein, LLYeung, CMKurath, PMao, JCFernandes, PBLartey, PAPernet, AG Synthesis and activity of nonhydrolyzable pseudomonic acid analogues. J Med Chem 32:151-60 (1989)  
Target
Name:
Isoleucine--tRNA ligase
Synonyms:
Isoleucine--tRNA ligase ileS tRNA synthetase (IleRS)
Type:
Enzyme
Mol. Mass.:
104286.05
Organism:
Escherichia coli
Description:
Residue:
938
  
Inhibitor
Name:
BDBM50227811
Synonyms:
CHEMBL287840
Type:
Small organic molecule
Emp. Form.:
C28H48O8
Mol. Mass.:
512.6759
SMILES:
[H][C@]1(O[C@H]1CC1CO[C@@H](C\C(C)=C\C(=O)CCCCCCCCCC(=O)OC)[C@H](O)[C@@H]1O)[C@@H](C)[C@H](C)O
: