Target
Sterol O-acyltransferase 1
Ligand
BDBM50227911
Substrate
Meas. Tech.
ChEMBL_28021 (CHEMBL641220)
IC50
17000±n/a nM
Citation
 DeVries, VGBloom, JDDutia, MDKatocs, ASLargis, EE Potential antiatherosclerotic agents. 6. Hypocholesterolemic trisubstituted urea analogues. J Med Chem 32:2318-25 (1989)  
Target
Name:
Sterol O-acyltransferase 1
Synonyms:
ACACT ACAT Acetyl-CoA acetyltransferase, mitochondrial Acyl-CoA: cholesterol acyltransferase (ACAT) Cholesterol acyltransferase 1 SOAT1 STAT
Type:
Multi-pass membrane protein may form homo- or heterodimers.
Mol. Mass.:
64751.94
Organism:
Homo sapiens (Human)
Description:
P35610
Residue:
550
  
Inhibitor
Name:
BDBM50227911
Synonyms:
CHEMBL77343
Type:
Small organic molecule
Emp. Form.:
C18H22F2N2OS
Mol. Mass.:
352.442
SMILES:
CC(C)(C)CCN(Cc1cccs1)C(=O)Nc1ccc(F)cc1F
: