Target
Delta-type/Kappa-type/Mu-type opioid receptor
Ligand
BDBM50228329
Substrate
Meas. Tech.
ChEMBL_147487 (CHEMBL754234)
IC50
39±n/a nM
Citation
 Botros, SLipkowski, AWLarson, DLStark, PATakemori, AEPortoghese, PS Opioid agonist and antagonist activities of peripherally selective derivatives of naltrexamine and oxymorphamine. J Med Chem 32:2068-71 (1989)  
Target
Name:
Delta-type/Kappa-type/Mu-type opioid receptor
Synonyms:
Opioid receptors; mu/kappa/delta
Type:
Mol. Mass.:
Description:
ASSAY_ID of ChEMBL is 357797
Components:
This complex has 3 components.
Component 1
Name:
Mu-type opioid receptor
Synonyms:
M-OR-1 MOR-1 MUOR1 Mu opiate receptor OPRM1 hMOP | mu-type opioid receptor isoform MOR-1
Type:
G Protein-Coupled Receptor (GPCR)
Mol. Mass.:
44789.51
Organism:
Homo sapiens (Human)
Description:
P35372
Residue:
400
  
Component 2
Name:
Kappa-type opioid receptor
Synonyms:
K-OR-1 Kappa-opioid receptor (KOR) Kappa-type opioid receptor (KOR) OPIATE Kappa OPRK1 kappa opioid receptor (KOR)
Type:
G Protein-Coupled Receptor (GPCR)
Mol. Mass.:
42648.76
Organism:
Homo sapiens (Human)
Description:
P41145
Residue:
380
  
Component 3
Name:
Delta-type opioid receptor
Synonyms:
D-OR-1 Delta opioid receptor OPIATE Delta OPRD1 OPRK1 | opioid receptor, delta 1
Type:
G Protein-Coupled Receptor (GPCR)
Mol. Mass.:
40382.98
Organism:
Homo sapiens (Human)
Description:
Competition binding assays were carried out using membrane preparations from transfected HN9.10 cells that constitutively expressed the delta opioid receptor.
Residue:
372
  
Inhibitor
Name:
BDBM50228329
Synonyms:
CHEMBL2112088
Type:
Small organic molecule
Emp. Form.:
C21H24N2O6
Mol. Mass.:
400.4251
SMILES:
[H][C@@]12Oc3c4c(C[C@@]5([H])N(C)CC[C@@]14[C@@]5(O)CCC2NC(=O)\C=C/C(O)=O)ccc3O
: