Target
Type-1 angiotensin II receptor A/Type-1 angiotensin II receptor B/Type-2 angiotensin II receptor
Ligand
BDBM50226743
Substrate
Meas. Tech.
ChEMBL_36468 (CHEMBL653121)
IC50
1400±n/a nM
Citation
 Carini, DJDuncia, JVJohnson, ALChiu, ATPrice, WAWong, PCTimmermans, PB Nonpeptide angiotensin II receptor antagonists: N-[(benzyloxy)benzyl]imidazoles and related compounds as potent antihypertensives. J Med Chem 33:1330-6 (1990)  
Target
Name:
Type-1 angiotensin II receptor A/Type-1 angiotensin II receptor B/Type-2 angiotensin II receptor
Synonyms:
Angiotensin II receptor | Type-1A/Type-1B/Type-2 angiotensin II receptor
Type:
Mol. Mass.:
Description:
ASSAY_ID of ChEMBL is 36477
Components:
This complex has 3 components.
Component 1
Name:
Type-1 angiotensin II receptor B
Synonyms:
AGTRB_RAT Agtr1 Angiotensin II AT1B Angiotensin II type 1b (AT-1b) receptor Type-1B angiotensin II receptor
Type:
Enzyme Catalytic Domain
Mol. Mass.:
40929.44
Organism:
RAT
Description:
Angiotensin II AT1B 0 RAT::P29089
Residue:
359
  
Component 2
Name:
Type-2 angiotensin II receptor
Synonyms:
AGTR2_RAT Agtr2 Angiotensin II receptor Type-2 angiotensin II receptor
Type:
Enzyme Catalytic Domain
Mol. Mass.:
41346.62
Organism:
RAT
Description:
Angiotensin II AT2 0 0::P35351
Residue:
363
  
Component 3
Name:
Type-1 angiotensin II receptor A
Synonyms:
AGTRA_RAT Agtr1 Angiotensin II AT1 Angiotensin II receptor (AT-1) type-1 Type-1A angiotensin II receptor
Type:
Enzyme Catalytic Domain
Mol. Mass.:
40910.53
Organism:
RAT
Description:
ANGIOTENSIN AT1 AGTR1 RAT::P25095
Residue:
359
  
Inhibitor
Name:
BDBM50226743
Synonyms:
CHEMBL282978
Type:
Small organic molecule
Emp. Form.:
C25H25ClN2O5
Mol. Mass.:
468.929
SMILES:
CCCCc1nc(COC(C)=O)c(Cl)n1Cc1ccc(cc1)C(=O)c1ccccc1C(O)=O
: