Target
Serotonin 2 (5-HT2) receptor
Ligand
BDBM50227974
Substrate
Meas. Tech.
ChEMBL_2163 (CHEMBL617152)
IC50
881±n/a nM
Citation
 Kikumoto, RHara, HNinomiya, KOsakabe, MSugano, MFukami, HTamao, Y Syntheses and platelet aggregation inhibitory and antithrombotic properties of [2-[(omega-aminoalkoxy)phenyl]ethyl]benzenes. J Med Chem 33:1818-23 (1990)  
Target
Name:
Serotonin 2 (5-HT2) receptor
Synonyms:
5-hydroxytryptamine receptor 2A/2B/2C
Type:
Mol. Mass.:
Description:
ASSAY_ID of ChEMBL is 2197419
Components:
This complex has 3 components.
Component 1
Name:
5-hydroxytryptamine receptor 2B
Synonyms:
5-HT2B 5HT2B_RAT Serotonin 2b (5-HT2b) receptor Srl
Type:
Enzyme Catalytic Domain
Mol. Mass.:
53668.47
Organism:
RAT
Description:
5-HT2B HTR2B RAT::P30994
Residue:
479
  
Component 2
Name:
5-hydroxytryptamine receptor 2C
Synonyms:
5-HT2C 5-hydroxytryptamine receptor 2C (5HT2c) 5ht1c Htr2c Serotonin receptor 2a and 2c (5HT2A and 5HT2C)
Type:
Enzyme
Mol. Mass.:
51935.10
Organism:
Rattus norvegicus (Rat)
Description:
P08909
Residue:
460
  
Component 3
Name:
5-hydroxytryptamine receptor 2A
Synonyms:
5-HT-2A 5-HT2A 5-hydroxytryptamine receptor 2A (5HT2A) Htr2 Serotonin Receptor 2A
Type:
G Protein-Coupled Receptor (GPCR)
Mol. Mass.:
52852.05
Organism:
Rattus norvegicus (rat)
Description:
Rat cortex membranes 5-HT2A receptors.
Residue:
471
  
Inhibitor
Name:
BDBM50227974
Synonyms:
CHEMBL298554
Type:
Small organic molecule
Emp. Form.:
C19H24ClNO
Mol. Mass.:
317.853
SMILES:
CN(C)CCCOc1ccc(Cl)cc1CCc1ccccc1
: