Target
cAMP-specific 3',5'-cyclic phosphodiesterase 4C
Ligand
BDBM14361
Substrate
Meas. Tech.
ChEMBL_42946 (CHEMBL884266)
IC50
490±n/a nM
Citation
 Saccomano, NAVinick, FJKoe, BKNielsen, JAWhalen, WMMeltz, MPhillips, DThadieo, PFJung, SChapin, DS Calcium-independent phosphodiesterase inhibitors as putative antidepressants: [3-(bicycloalkyloxy)-4-methoxyphenyl]-2-imidazolidinones. J Med Chem 34:291-8 (1991)  
Target
Name:
cAMP-specific 3',5'-cyclic phosphodiesterase 4C
Synonyms:
Dpde1 Pde4c
Type:
PROTEIN
Mol. Mass.:
60038.21
Organism:
Rattus norvegicus
Description:
ChEMBL_104732
Residue:
536
  
Inhibitor
Name:
BDBM14361
Synonyms:
(R,S)-Rolipram 4-[3-(cyclopentyloxy)-4-methoxyphenyl]pyrrolidin-2-one CHEMBL63 | Rolipram
Type:
Small organic molecule
Emp. Form.:
C16H21NO3
Mol. Mass.:
275.3428
SMILES:
COc1ccc(cc1OC1CCCC1)C1CNC(=O)C1
: