Target
cAMP-specific 3',5'-cyclic phosphodiesterase 4C
Ligand
BDBM50228861
Substrate
Meas. Tech.
ChEMBL_176821 (CHEMBL780514)
IC50
22000±n/a nM
Citation
 Vinick, FJSaccomano, NAKoe, BKNielsen, JAWilliams, IHThadeio, PFJung, SMeltz, MJohnson, JLebel, LA Nicotinamide ethers: novel inhibitors of calcium-independent phosphodiesterase and [3H]rolipram binding. J Med Chem 34:86-9 (1991)  
Target
Name:
cAMP-specific 3',5'-cyclic phosphodiesterase 4C
Synonyms:
Dpde1 Pde4c
Type:
PROTEIN
Mol. Mass.:
60038.21
Organism:
Rattus norvegicus
Description:
ChEMBL_104732
Residue:
536
  
Inhibitor
Name:
BDBM50228861
Synonyms:
CHEMBL169269
Type:
Small organic molecule
Emp. Form.:
C20H15N3O2
Mol. Mass.:
329.352
SMILES:
O=C(NCc1ccccc1)c1cccnc1Oc1cccc(c1)C#N
: