Target
cAMP-specific 3',5'-cyclic phosphodiesterase 4C
Ligand
BDBM50228859
Substrate
Meas. Tech.
ChEMBL_42939 (CHEMBL654581)
IC50
2200±n/a nM
Citation
 Vinick, FJSaccomano, NAKoe, BKNielsen, JAWilliams, IHThadeio, PFJung, SMeltz, MJohnson, JLebel, LA Nicotinamide ethers: novel inhibitors of calcium-independent phosphodiesterase and [3H]rolipram binding. J Med Chem 34:86-9 (1991)  
Target
Name:
cAMP-specific 3',5'-cyclic phosphodiesterase 4C
Synonyms:
Dpde1 Pde4c
Type:
PROTEIN
Mol. Mass.:
60038.21
Organism:
Rattus norvegicus
Description:
ChEMBL_104732
Residue:
536
  
Inhibitor
Name:
BDBM50228859
Synonyms:
CHEMBL352655
Type:
Small organic molecule
Emp. Form.:
C19H14Cl2N2O2
Mol. Mass.:
373.233
SMILES:
Clc1ccc(Oc2ncccc2C(=O)NCc2ccccc2)cc1Cl
: