Target
Similar to alpha-tubulin isoform 1
Ligand
BDBM50229492
Substrate
Meas. Tech.
ChEMBL_39798 (CHEMBL876771)
IC50
8800±n/a nM
Citation
 Cushman, MNagarathnam, DGopal, DChakraborti, AKLin, CMHamel, E Synthesis and evaluation of stilbene and dihydrostilbene derivatives as potential anticancer agents that inhibit tubulin polymerization. J Med Chem 34:2579-88 (1991)  
Target
Name:
Similar to alpha-tubulin isoform 1
Synonyms:
Similar to alpha-tubulin isoform 1
Type:
PROTEIN
Mol. Mass.:
10383.05
Organism:
Bos taurus
Description:
ChEMBL_104716
Residue:
99
  
Inhibitor
Name:
BDBM50229492
Synonyms:
CHEMBL315541
Type:
Small organic molecule
Emp. Form.:
C18H20O4
Mol. Mass.:
300.349
SMILES:
COc1cccc(\C=C/c2cc(OC)c(OC)c(OC)c2)c1
: