Target
C5a anaphylatoxin chemotactic receptor 1
Ligand
BDBM50229899
Substrate
Meas. Tech.
ChEBML_41451
IC50
>577000±n/a nM
Citation
 Lanza, TJDurette, PLRollins, TSiciliano, SCianciarulo, DNKobayashi, SVCaldwell, CGSpringer, MSHagmann, WK Substituted 4,6-diaminoquinolines as inhibitors of C5a receptor binding. J Med Chem 35:252-8 (1992)  
Target
Name:
C5a anaphylatoxin chemotactic receptor 1
Synonyms:
C5AR C5AR1_HUMAN C5a anaphylatoxin chemotactic receptor C5a-R | CD_antigen=CD88
Type:
Enzyme
Mol. Mass.:
39347.68
Organism:
Homo sapiens (Human)
Description:
P21730
Residue:
350
  
Inhibitor
Name:
BDBM50229899
Synonyms:
CHEMBL87452
Type:
Small organic molecule
Emp. Form.:
C10H11N3
Mol. Mass.:
173.2144
SMILES:
Cc1cc(N)c2cc(N)ccc2n1
: