Target
DNA topoisomerase 2-beta
Ligand
BDBM50229966
Substrate
Meas. Tech.
ChEBML_75879
IC50
1690±n/a nM
Citation
 Taguchi, MKondo, HInoue, YKawahata, YJinbo, YSakamoto, FTsukamoto, G Synthesis and antibacterial activity of new tetracyclic quinolone antibacterials. J Med Chem 35:94-9 (1992)  
Target
Name:
DNA topoisomerase 2-beta
Synonyms:
DNA topoisomerase II TOP2B | TOP2B_HUMAN
Type:
PROTEIN
Mol. Mass.:
183284.13
Organism:
Homo sapiens (Human)
Description:
ChEMBL_51583
Residue:
1626
  
Inhibitor
Name:
BDBM50229966
Synonyms:
DESMETHYL-OFLOXACIN | Desmethyl-Ofloxacin (5%)
Type:
Small organic molecule
Emp. Form.:
C17H18FN3O4
Mol. Mass.:
347.3409
SMILES:
CC1COc2c(N3CCNCC3)c(F)cc3c2n1cc(C(O)=O)c3=O
: