Target
Gastrin/cholecystokinin type B receptor
Ligand
BDBM50230666
Substrate
Meas. Tech.
ChEMBL_48424 (CHEMBL660352)
Ki
12±n/a nM
Citation
 Higginbottom, MKneen, CRatcliffe, GS Rationally designed"dipeptoid" analogues of CCK. A Free-Wilson/Fujita-Ban analysis of some alpha-methyltryptophan derivatives as CCK-B antagonists. J Med Chem 35:1572-7 (1992)  
Target
Name:
Gastrin/cholecystokinin type B receptor
Synonyms:
Cckbr Cholecystokinin receptor Gastrin/cholecystokinin type B receptor
Type:
Enzyme Catalytic Domain
Mol. Mass.:
49196.59
Organism:
MOUSE
Description:
Cholecystokinin A CCKBR MOUSE::P56481
Residue:
453
  
Inhibitor
Name:
BDBM50230666
Synonyms:
CHEMBL3351025
Type:
Small organic molecule
Emp. Form.:
C33H42N4O6
Mol. Mass.:
590.7098
SMILES:
C[C@@H]1CCCC[C@H]1OC(=O)N[C@](C)(Cc1c[nH]c2ccccc12)C(=O)N[C@H](CNC(=O)CCC(O)=O)Cc1ccccc1
: