Target
Gastrin/cholecystokinin type B receptor
Ligand
BDBM50230679
Substrate
Meas. Tech.
ChEMBL_48424 (CHEMBL660352)
Ki
398±n/a nM
Citation
 Higginbottom, MKneen, CRatcliffe, GS Rationally designed"dipeptoid" analogues of CCK. A Free-Wilson/Fujita-Ban analysis of some alpha-methyltryptophan derivatives as CCK-B antagonists. J Med Chem 35:1572-7 (1992)  
Target
Name:
Gastrin/cholecystokinin type B receptor
Synonyms:
Cckbr Cholecystokinin receptor Gastrin/cholecystokinin type B receptor
Type:
Enzyme Catalytic Domain
Mol. Mass.:
49196.59
Organism:
MOUSE
Description:
Cholecystokinin A CCKBR MOUSE::P56481
Residue:
453
  
Inhibitor
Name:
BDBM50230679
Synonyms:
CHEMBL3350691
Type:
Small organic molecule
Emp. Form.:
C34H44N4O7
Mol. Mass.:
620.7358
SMILES:
O.CC1(C)C2CCC1(C)[C@H](C2)OC(=O)N[C@@H](Cc1c[nH]c2ccccc12)C(=O)NC[C@H](NC(=O)CCC(O)=O)c1ccccc1
: