Target
Type-1 angiotensin II receptor A/B
Ligand
BDBM50231009
Substrate
Meas. Tech.
ChEMBL_35110 (CHEMBL649312)
Ki
50±n/a nM
Citation
 Kim, KSQian, LBird, JEDickinson, KEMoreland, SSchaeffer, TRWaldron, TLDelaney, CLWeller, HNMiller, AV Quinoxaline N-oxide containing potent angiotensin II receptor antagonists: synthesis, biological properties, and structure-activity relationships. J Med Chem 36:2335-42 (1993)  
Target
Name:
Type-1 angiotensin II receptor A/B
Synonyms:
Angiotensin II receptor (AT-1) type-1 | Type-1A/Type-1B angiotensin II receptor
Type:
Mol. Mass.:
Description:
ASSAY_ID of ChEMBL is 901964
Components:
This complex has 2 components.
Component 1
Name:
Type-1 angiotensin II receptor B
Synonyms:
AGTRB_RAT Agtr1 Angiotensin II AT1B Angiotensin II type 1b (AT-1b) receptor Type-1B angiotensin II receptor
Type:
Enzyme Catalytic Domain
Mol. Mass.:
40929.44
Organism:
RAT
Description:
Angiotensin II AT1B 0 RAT::P29089
Residue:
359
  
Component 2
Name:
Type-1 angiotensin II receptor A
Synonyms:
AGTRA_RAT Agtr1 Angiotensin II AT1 Angiotensin II receptor (AT-1) type-1 Type-1A angiotensin II receptor
Type:
Enzyme Catalytic Domain
Mol. Mass.:
40910.53
Organism:
RAT
Description:
ANGIOTENSIN AT1 AGTR1 RAT::P25095
Residue:
359
  
Inhibitor
Name:
BDBM50231009
Synonyms:
CHEMBL76765
Type:
Small organic molecule
Emp. Form.:
C30H30N6O5
Mol. Mass.:
554.5964
SMILES:
CCCCOc1ccc2[n+]([O-])c(CCCC)c(Oc3ccc(cc3)-c3ccccc3-c3nn[nH]n3)nc2c1C(O)=O
: