Target
DNA topoisomerase 2-alpha/2-beta
Ligand
BDBM50231255
Substrate
Meas. Tech.
ChEMBL_208607 (CHEMBL812284)
EC50
52000±n/a nM
Citation
 Wentland, MPLesher, GYReuman, MGruett, MDSingh, BAldous, SCDorff, PHRake, JBCoughlin, SA Mammalian topoisomerase II inhibitory activity of 1-cyclopropyl-6,8- difluoro-1,4-dihydro-7-(2,6-dimethyl-4-pyridinyl)-4-oxo-3-quinolinecarb oxylic acid and related derivatives. J Med Chem 36:2801-9 (1993)  
Target
Name:
DNA topoisomerase 2-alpha/2-beta
Synonyms:
DNA topoisomerase II
Type:
Mol. Mass.:
Description:
ASSAY_ID of ChEMBL is 1821483
Components:
This complex has 2 components.
Component 1
Name:
DNA topoisomerase 2-alpha
Synonyms:
DNA topoisomerase 2-alpha DNA topoisomerase II (Topo II) DNA topoisomerase II, alpha isozyme TOP2A Topoisomerase I/II | Topoisomerase II alpha (HuTopoIIα)
Type:
Protein
Mol. Mass.:
174415.30
Organism:
Homo sapiens (Human)
Description:
P11388
Residue:
1531
  
Component 2
Name:
DNA topoisomerase 2-beta
Synonyms:
DNA topoisomerase II TOP2B | TOP2B_HUMAN
Type:
PROTEIN
Mol. Mass.:
183284.13
Organism:
Homo sapiens (Human)
Description:
ChEMBL_51583
Residue:
1626
  
Inhibitor
Name:
BDBM50231255
Synonyms:
CHEMBL327663
Type:
Small organic molecule
Emp. Form.:
C18H12F2N2O3
Mol. Mass.:
342.2963
SMILES:
OC(=O)c1cn(C2CC2)c2c(F)c(c(F)cc2c1=O)-c1cccnc1
: