Target
5-hydroxytryptamine receptor 1A
Ligand
BDBM50231637
Substrate
Meas. Tech.
ChEBML_1513
Ki
692±n/a nM
Citation
 Agarwal, APearson, PPTaylor, EWLi, HBDahlgren, THerslöf, MYang, YLambert, GNelson, DLRegan, JW Three-dimensional quantitative structure-activity relationships of 5-HT receptor binding data for tetrahydropyridinylindole derivatives: a comparison of the Hansch and CoMFA methods. J Med Chem 36:4006-14 (1993)  
Target
Name:
5-hydroxytryptamine receptor 1A
Synonyms:
5-HT-1A 5-HT1A 5-hydroxytryptamine receptor 1A (5HT1A) 5ht1a Htr1a Serotonin 1a (5-HT1a) receptor/Adrenergic receptor alpha-1 | Serotonin receptor 1A
Type:
G Protein-Coupled Receptor (GPCR)
Mol. Mass.:
46445.29
Organism:
Rattus norvegicus (rat)
Description:
Binding assays were performed using rat hippocampal membranes.
Residue:
422
  
Inhibitor
Name:
BDBM50231637
Synonyms:
CHEMBL26980
Type:
Small organic molecule
Emp. Form.:
C15H19N3O2S
Mol. Mass.:
305.395
SMILES:
CN1CCC(=CC1)c1c[nH]c2ccc(NS(C)(=O)=O)cc12
: