Target
Estrogen receptor
Ligand
BDBM50228836
Substrate
Meas. Tech.
ChEMBL_1644146 (CHEMBL3993075)
Kd
386±n/a nM
Citation
 Li, JTian, YWang, DWu, YYe, XLi, Z An in-tether sulfoxide chiral center influences the biophysical properties of the N-capped peptides. Bioorg Med Chem 25:1756-1761 (2017)  
Target
Name:
Estrogen receptor
Synonyms:
ER ESR ESR1_HUMAN Estrogen receptor Estrogen receptor (ER-alpha) Estrogen receptor alpha (ER) Nuclear receptor subfamily 3 group A member 1
Type:
Protein
Mol. Mass.:
66230.44
Organism:
Homo sapiens (Human)
Description:
P03372
Residue:
595
  
Inhibitor
Name:
BDBM50228836
Synonyms:
CHEMBL4060042
Type:
Small organic molecule
Emp. Form.:
C94H135N25O21S
Mol. Mass.:
1983.298
SMILES:
CC[C@H](C)[C@H](NC(=O)CN1CC[S+]([O-])CCC(=O)N[C@@H](CCCNC(N)=N)C(=O)N[C@@H](CCCCNC(=O)c2ccc3c(c2)C(=O)OC32c3ccc(O)cc3Oc3cc(O)ccc23)C1=O)C(=O)N[C@@H](CC(C)C)C(=O)N[C@@H](CCCNC(N)=N)C(=O)N[C@@H](CCCNC(N)=N)C(=O)N[C@@H](CC(C)C)C(=O)N[C@@H](CC(C)C)C(=O)N[C@@H](CCC(N)=O)C(=O)NCC(=O)N[C@@H](Cc1c[nH]c2ccccc12)C(N)=O
: