Target
Receptor-interacting serine/threonine-protein kinase 1
Ligand
BDBM50229541
Substrate
Meas. Tech.
ChEBML_1644186
EC50
221±n/a nM
Citation
 Ren, YSu, YSun, LHe, SMeng, LLiao, DLiu, XMa, YLiu, CLi, SRuan, HLei, XWang, XZhang, Z Discovery of a Highly Potent, Selective, and Metabolically Stable Inhibitor of Receptor-Interacting Protein 1 (RIP1) for the Treatment of Systemic Inflammatory Response Syndrome. J Med Chem 60:972-986 (2017)  
Target
Name:
Receptor-interacting serine/threonine-protein kinase 1
Synonyms:
Cell death protein RIP RIP-1 RIPK1 Receptor-interacting protein 1
Type:
Enzyme Catalytic Domain
Mol. Mass.:
75926.99
Organism:
Homo sapiens (Human)
Description:
Q13546
Residue:
671
  
Inhibitor
Name:
BDBM50229541
Synonyms:
CHEMBL4096270
Type:
Small organic molecule
Emp. Form.:
C12H19NOS
Mol. Mass.:
225.35
SMILES:
CCC(C)(C)C(=O)N(C)Cc1cccs1
: