Target
Prostaglandin G/H synthase 2
Ligand
BDBM50229717
Substrate
Meas. Tech.
ChEBML_1644311
IC50
1450±n/a nM
Citation
 Elshemy, HAHAbdelall, EKAAzouz, AAMoawad, AAli, WAMSafwat, NM Synthesis, anti-inflammatory, cyclooxygenases inhibitions assays and histopathological study of poly-substituted 1,3,5-triazines: Confirmation of regiospecific pyrazole cyclization by HMBC. Eur J Med Chem 127:10-21 (2017)  
Target
Name:
Prostaglandin G/H synthase 2
Synonyms:
COX2 Cyclooxygenase 2 (COX-2) Cyclooxygenase-2 (COX-2 AA) Cyclooxygenase-2 (COX-2) PGH2_HUMAN PHS II Prostaglandin E synthase/G/H synthase 2 Prostaglandin-endoperoxide synthase 2
Type:
Enzyme
Mol. Mass.:
69003.89
Organism:
Homo sapiens (Human)
Description:
Recombinant Cox-2 provided by Cayman (Cayman Chemical Co.,Ann Arbor, MI).
Residue:
604
  
Inhibitor
Name:
BDBM50229717
Synonyms:
CHEMBL4085904
Type:
Small organic molecule
Emp. Form.:
C26H28N8O2
Mol. Mass.:
484.5529
SMILES:
C1CN(CCO1)c1nc(Nc2ccc(cc2)-c2ccnn2-c2ccccc2)nc(n1)N1CCOCC1
: