Target
Prostaglandin G/H synthase 1
Ligand
BDBM50229728
Substrate
Meas. Tech.
ChEBML_1644309
IC50
3980±n/a nM
Citation
 Elshemy, HAHAbdelall, EKAAzouz, AAMoawad, AAli, WAMSafwat, NM Synthesis, anti-inflammatory, cyclooxygenases inhibitions assays and histopathological study of poly-substituted 1,3,5-triazines: Confirmation of regiospecific pyrazole cyclization by HMBC. Eur J Med Chem 127:10-21 (2017)  
Target
Name:
Prostaglandin G/H synthase 1
Synonyms:
COX1 Cyclooxygenase-1 (COX-1) PTGS1 | Prostaglandin G/H synthase (cyclooxygenase)
Type:
Protein
Mol. Mass.:
68868.60
Organism:
Ovis aries (Sheep)
Description:
Residue:
600
  
Inhibitor
Name:
BDBM50229728
Synonyms:
CHEMBL4062843
Type:
Small organic molecule
Emp. Form.:
C22H29N7O3
Mol. Mass.:
439.5108
SMILES:
CN(C)\C=C\C(=O)c1ccc(Nc2nc(nc(n2)N2CCOCC2)N2CCOCC2)cc1
: